Target
ATP-binding cassette sub-family C member 9
Ligand
BDBM50247783
Substrate
Meas. Tech.
ChEMBL_495672 (CHEMBL1006149)
EC50
6850±n/a nM
Citation
 Zhang, XQiu, YLi, XBhattacharjee, SWoods, MKraft, PLundeen, SGSui, Z Discovery and structure-activity relationships of a novel series of benzopyran-based K(ATP) openers for urge urinary incontinence. Bioorg Med Chem 17:855-66 (2009)  
Target
Name:
ATP-binding cassette sub-family C member 9
Synonyms:
ABCC9 ATP-binding cassette transporter sub-family C member 9 Sulfonylurea receptor 2 | Sulfonylurea receptor 2, Kir6.2
Type:
PROTEIN
Mol. Mass.:
174236.59
Organism:
Homo sapiens (Human)
Description:
ChEMBL_495672
Residue:
1549
  
Inhibitor
Name:
BDBM50247783
Synonyms:
(3S,4R)-4-(5-Chloro-1H-indazol-3-ylamino)-3-hydroxy-2,2-dimethyl-chroman-6-carbonitrile | CHEMBL452140
Type:
Small organic molecule
Emp. Form.:
C19H17ClN4O2
Mol. Mass.:
368.817
SMILES:
CC1(C)Oc2ccc(cc2[C@@H](Nc2n[nH]c3ccc(Cl)cc23)[C@@H]1O)C#N
: