Target
Purine nucleoside phosphorylase
Ligand
BDBM50293071
Substrate
Meas. Tech.
ChEMBL_519471 (CHEMBL951777)
Ki
4.20±n/a nM
Citation
 Clinch, KEvans, GBFröhlich, RFFurneaux, RHKelly, PMLegentil, LMurkin, ASLi, LSchramm, VLTyler, PCWoolhouse, AD Third-generation immucillins: syntheses and bioactivities of acyclic immucillin inhibitors of human purine nucleoside phosphorylase. J Med Chem 52:1126-43 (2009)  
Target
Name:
Purine nucleoside phosphorylase
Synonyms:
Inosine phosphorylase NP PNPH_HUMAN | Purine nucleoside phosphorylase (PNPase)
Type:
Enzyme
Mol. Mass.:
32119.53
Organism:
Homo sapiens (Human)
Description:
Residue:
289
  
Inhibitor
Name:
BDBM50293071
Synonyms:
7-({[(2S)-2,3-Dihydroxypropyl]amino}methyl)-3,5-dihydro-4Hpyrrolo[3,2-d]pyrimidin-4-one | CHEMBL490283
Type:
Small organic molecule
Emp. Form.:
C10H14N4O3
Mol. Mass.:
238.2432
SMILES:
OC[C@@H](O)CNCc1c[nH]c2c1nc[nH]c2=O
: