Target
Peroxisome proliferator-activated receptor alpha
Ligand
BDBM50256108
Substrate
Meas. Tech.
ChEMBL_519278 (CHEMBL947730)
EC50
1±n/a nM
Citation
 Pingali, HJain, MShah, SPatil, PMakadia, PZaware, PSairam, KVJamili, JGoel, APatel, MPatel, P Modulation of PPAR receptor subtype selectivity of the ligands: aliphatic chain vs aromatic ring as a spacer between pharmacophore and the lipophilic moiety. Bioorg Med Chem Lett 18:6471-5 (2008)  
Target
Name:
Peroxisome proliferator-activated receptor alpha
Synonyms:
NR1C1 PPAR PPAR-alpha PPARA_HUMAN Peroxisome proliferator-activated receptor | Peroxisome proliferator-activated receptor alpha (PPAR alpha)
Type:
Enzyme
Mol. Mass.:
52222.08
Organism:
Homo sapiens (Human)
Description:
Q07869
Residue:
468
  
Inhibitor
Name:
BDBM50256108
Synonyms:
4-(6-(5-methyl-2-p-tolyloxazol-4-yl)hexyloxyimino)-4-phenylbutanoic acid | CHEMBL481550
Type:
Small organic molecule
Emp. Form.:
C27H32N2O4
Mol. Mass.:
448.554
SMILES:
Cc1oc(nc1CCCCCCO\N=C(\CCC(O)=O)c1ccccc1)-c1ccc(C)cc1
: