Target
Carbonic anhydrase
Ligand
BDBM10877
Substrate
Meas. Tech.
ChEMBL_515851 (CHEMBL993110)
Ki
7540±n/a nM
Citation
 Isik, SKockar, FAydin, MArslan, OGuler, OOInnocenti, AScozzafava, ASupuran, CT Carbonic anhydrase inhibitors: inhibition of the beta-class enzyme from the yeast Saccharomyces cerevisiae with sulfonamides and sulfamates. Bioorg Med Chem 17:1158-63 (2009)  
Target
Name:
Carbonic anhydrase
Synonyms:
CAN_YEAST NCE3
Type:
PROTEIN
Mol. Mass.:
24861.97
Organism:
Saccharomyces cerevisiae
Description:
ChEMBL_1507033
Residue:
221
  
Inhibitor
Name:
BDBM10877
Synonyms:
4-(2-hydroxyethyl)benzene-1-sulfonamide JMC522226 Compound 21 aromatic/heteroaromatic sulfonamide 22
Type:
Small organic molecule
Emp. Form.:
C8H11NO3S
Mol. Mass.:
201.243
SMILES:
NS(=O)(=O)c1ccc(CCO)cc1
: