Target
Mu-type opioid receptor
Ligand
BDBM50255900
Substrate
Meas. Tech.
ChEMBL_515863 (CHEMBL993917)
Ki
11±n/a nM
Citation
 Hayashi, SHirao, AImai, ANakamura, HMurata, YOhashi, KNakata, E Novel non-peptide nociceptin/orphanin FQ receptor agonist, 1-[1-(1-Methylcyclooctyl)-4-piperidinyl]-2-[(3R)-3-piperidinyl]-1H-benzimidazole: design, synthesis, and structure-activity relationship of oral receptor occupancy in the brain for orally potent antianxiety drug. J Med Chem 52:610-25 (2009)  
Target
Name:
Mu-type opioid receptor
Synonyms:
M-OR-1 MOR-1 MUOR1 Mu opiate receptor OPRM1 hMOP | mu-type opioid receptor isoform MOR-1
Type:
G Protein-Coupled Receptor (GPCR)
Mol. Mass.:
44789.51
Organism:
Homo sapiens (Human)
Description:
P35372
Residue:
400
  
Inhibitor
Name:
BDBM50255900
Synonyms:
1-[1-(1-Methylcyclooctyl)-4-piperidinyl]-2-[(3S)-1-methyl-3-piperidinyl]-1H-benzimidazole | CHEMBL501331
Type:
Small organic molecule
Emp. Form.:
C27H42N4
Mol. Mass.:
422.6492
SMILES:
CN1CCC[C@@H](C1)c1nc2ccccc2n1C1CCN(CC1)C1(C)CCCCCCC1
: