Target
Nociceptin receptor
Ligand
BDBM50255954
Substrate
Meas. Tech.
ChEMBL_516123 (CHEMBL983267)
EC50
13±n/a nM
Citation
 Hayashi, SHirao, AImai, ANakamura, HMurata, YOhashi, KNakata, E Novel non-peptide nociceptin/orphanin FQ receptor agonist, 1-[1-(1-Methylcyclooctyl)-4-piperidinyl]-2-[(3R)-3-piperidinyl]-1H-benzimidazole: design, synthesis, and structure-activity relationship of oral receptor occupancy in the brain for orally potent antianxiety drug. J Med Chem 52:610-25 (2009)  
Target
Name:
Nociceptin receptor
Synonyms:
KOR-3 Mu-type opioid receptor (Mu) Nociceptin Receptor (ORL1 Receptor) Nociceptin receptor (ORL-1) Nociceptin/Orphanin FQ, NOP receptor OPIATE ORL-1 OPRL1 protein ORL1 Opioid receptor like-1 Orphanin FQ receptor (ORL1) | P41146
Type:
G Protein-Coupled Receptor (GPCR)
Mol. Mass.:
40702.87
Organism:
Homo sapiens (Human)
Description:
P41146
Residue:
370
  
Inhibitor
Name:
BDBM50255954
Synonyms:
2-(1H-Indol-6-yl)-1-[1-(1-methylcyclooctyl)piperidin-4-yl]-1Hbenzimidazole | CHEMBL481548
Type:
Small organic molecule
Emp. Form.:
C29H36N4
Mol. Mass.:
440.6229
SMILES:
CC1(CCCCCCC1)N1CCC(CC1)n1c(nc2ccccc12)-c1ccc2cc[nH]c2c1
: