Target
Nociceptin receptor
Ligand
BDBM50255898
Substrate
Meas. Tech.
ChEMBL_515862 (CHEMBL993121)
Ki
0.200000±n/a nM
Citation
 Hayashi, SHirao, AImai, ANakamura, HMurata, YOhashi, KNakata, E Novel non-peptide nociceptin/orphanin FQ receptor agonist, 1-[1-(1-Methylcyclooctyl)-4-piperidinyl]-2-[(3R)-3-piperidinyl]-1H-benzimidazole: design, synthesis, and structure-activity relationship of oral receptor occupancy in the brain for orally potent antianxiety drug. J Med Chem 52:610-25 (2009)  
Target
Name:
Nociceptin receptor
Synonyms:
KOR-3 Mu-type opioid receptor (Mu) Nociceptin Receptor (ORL1 Receptor) Nociceptin receptor (ORL-1) Nociceptin/Orphanin FQ, NOP receptor OPIATE ORL-1 OPRL1 protein ORL1 Opioid receptor like-1 Orphanin FQ receptor (ORL1) | P41146
Type:
G Protein-Coupled Receptor (GPCR)
Mol. Mass.:
40702.87
Organism:
Homo sapiens (Human)
Description:
P41146
Residue:
370
  
Inhibitor
Name:
BDBM50255898
Synonyms:
1-[1-(1-Methylcyclooctyl)-4-piperidinyl]-2-[(3R)-1-methyl-3-piperidinyl]-1H-benzimidazole | CHEMBL518950
Type:
Small organic molecule
Emp. Form.:
C27H42N4
Mol. Mass.:
422.6492
SMILES:
CN1CCC[C@H](C1)c1nc2ccccc2n1C1CCN(CC1)C1(C)CCCCCCC1
: