Target
Mu-type opioid receptor
Ligand
BDBM50255134
Substrate
Meas. Tech.
ChEMBL_515867 (CHEMBL993921)
Ki
11±n/a nM
Citation
 Hayashi, SHirao, AImai, ANakamura, HMurata, YOhashi, KNakata, E Novel non-peptide nociceptin/orphanin FQ receptor agonist, 1-[1-(1-Methylcyclooctyl)-4-piperidinyl]-2-[(3R)-3-piperidinyl]-1H-benzimidazole: design, synthesis, and structure-activity relationship of oral receptor occupancy in the brain for orally potent antianxiety drug. J Med Chem 52:610-25 (2009)  
Target
Name:
Mu-type opioid receptor
Synonyms:
M-OR-1 MOR-1 MUOR1 Mu opiate receptor OPRM1 hMOP | mu-type opioid receptor isoform MOR-1
Type:
G Protein-Coupled Receptor (GPCR)
Mol. Mass.:
44789.51
Organism:
Homo sapiens (Human)
Description:
P35372
Residue:
400
  
Inhibitor
Name:
BDBM50255134
Synonyms:
2-(3-{1-[1-(1-Methylcyclooctyl)piperidin-4-yl]-1H-benzimidazol-2-yl}phenoxy)ethanol | CHEMBL480425
Type:
Small organic molecule
Emp. Form.:
C29H39N3O2
Mol. Mass.:
461.6389
SMILES:
CC1(CCCCCCC1)N1CCC(CC1)n1c(nc2ccccc12)-c1cccc(OCCO)c1
: