Target
5-hydroxytryptamine receptor 6
Ligand
BDBM50266555
Substrate
Meas. Tech.
ChEMBL_517123 (CHEMBL989586)
EC50
3.2±n/a nM
Citation
 Alcalde, EMesquida, NLópez-Pérez, SFrigola, JMercè, R Indene-based scaffolds. 2. An indole-indene switch: discovery of novel indenylsulfonamides as 5-HT6 serotonin receptor agonists. J Med Chem 52:675-87 (2009)  
Target
Name:
5-hydroxytryptamine receptor 6
Synonyms:
5-HT-6 5-hydroxytryptamine receptor 6 (5-HT-6) 5-hydroxytryptamine receptor 6 (5HT6) HTR6 Serotonin 6 (5-HT6) receptor | Serotonin Receptor 6
Type:
G Protein-Coupled Receptor (GPCR)
Mol. Mass.:
46968.43
Organism:
Homo sapiens (Human)
Description:
P50406
Residue:
440
  
Inhibitor
Name:
BDBM50266555
Synonyms:
CHEMBL457570 | N-(3-(2-(dimethylamino)ethyl)-2-methyl-1H-inden-5-yl)naphthalene-2-sulfonamide
Type:
Small organic molecule
Emp. Form.:
C24H26N2O2S
Mol. Mass.:
406.54
SMILES:
CN(C)CCC1=C(C)Cc2ccc(NS(=O)(=O)c3ccc4ccccc4c3)cc12
: