Target
Histamine H1 receptor
Ligand
BDBM50275884
Substrate
Meas. Tech.
ChEMBL_493057 (CHEMBL953171)
Kd
741.31±n/a nM
Citation
 Ghorai, PKraus, AKeller, MGötte, CIgel, PSchneider, ESchnell, DBernhardt, GDove, SZabel, MElz, SSeifert, RBuschauer, A Acylguanidines as bioisosteres of guanidines: NG-acylated imidazolylpropylguanidines, a new class of histamine H2 receptor agonists. J Med Chem 51:7193-204 (2009)  
Target
Name:
Histamine H1 receptor
Synonyms:
HISTAMINE H1 HRH1_CAVPO
Type:
G Protein-Coupled Receptor (GPCR)
Mol. Mass.:
55641.53
Organism:
Cavia porcellus (domestic guinea pig)
Description:
Guinea pig cerebellum was used in binding assay.
Residue:
488
  
Inhibitor
Name:
BDBM50275884
Synonyms:
CHEMBL471413 | N1-(3,3-Diphenylpropanoyl)-N2-[3-(1H-imidazol-4-yl)propyl]guanidine
Type:
Small organic molecule
Emp. Form.:
C22H25N5O
Mol. Mass.:
375.4668
SMILES:
NC(NC(=O)CC(c1ccccc1)c1ccccc1)=NCCCc1cnc[nH]1
: