Target
Histamine H2 receptor
Ligand
BDBM86740
Substrate
Meas. Tech.
ChEMBL_493052 (CHEMBL953166)
EC50
67.61±n/a nM
Citation
 Ghorai, PKraus, AKeller, MGötte, CIgel, PSchneider, ESchnell, DBernhardt, GDove, SZabel, MElz, SSeifert, RBuschauer, A Acylguanidines as bioisosteres of guanidines: NG-acylated imidazolylpropylguanidines, a new class of histamine H2 receptor agonists. J Med Chem 51:7193-204 (2009)  
Target
Name:
Histamine H2 receptor
Synonyms:
Gastric receptor I HISTAMINE H2 HRH2_CAVPO | Histamine H2-Gs alpha S
Type:
G Protein-Coupled Receptor (GPCR)
Mol. Mass.:
40567.22
Organism:
Cavia porcellus (domestic guinea pig)
Description:
For the H2 receptor-binding assays, guinea pig striatum was used.
Residue:
359
  
Inhibitor
Name:
BDBM86740
Synonyms:
UR-AK24 | UR-AK57
Type:
Small organic molecule
Emp. Form.:
C17H29N5O
Mol. Mass.:
319.4451
SMILES:
CC(CC(=O)NC(N)=NCCCc1cnc[nH]1)C1CCCCC1
: