Target
Histamine H2 receptor
Ligand
BDBM50413180
Substrate
Meas. Tech.
ChEMBL_493052 (CHEMBL953166)
EC50
776.25±n/a nM
Citation
 Ghorai, PKraus, AKeller, MGötte, CIgel, PSchneider, ESchnell, DBernhardt, GDove, SZabel, MElz, SSeifert, RBuschauer, A Acylguanidines as bioisosteres of guanidines: NG-acylated imidazolylpropylguanidines, a new class of histamine H2 receptor agonists. J Med Chem 51:7193-204 (2009)  
Target
Name:
Histamine H2 receptor
Synonyms:
Gastric receptor I HISTAMINE H2 HRH2_CAVPO | Histamine H2-Gs alpha S
Type:
G Protein-Coupled Receptor (GPCR)
Mol. Mass.:
40567.22
Organism:
Cavia porcellus (domestic guinea pig)
Description:
For the H2 receptor-binding assays, guinea pig striatum was used.
Residue:
359
  
Inhibitor
Name:
BDBM50413180
Synonyms:
CHEMBL472271
Type:
Small organic molecule
Emp. Form.:
C22H23Br2N5O
Mol. Mass.:
533.259
SMILES:
NC(NC(=O)CC(c1ccc(Br)cc1)c1ccc(Br)cc1)=NCCCc1cnc[nH]1
: