Target
Histamine H2 receptor
Ligand
BDBM86745
Substrate
Meas. Tech.
ChEMBL_493052 (CHEMBL953166)
EC50
165.96±n/a nM
Citation
 Ghorai, PKraus, AKeller, MGötte, CIgel, PSchneider, ESchnell, DBernhardt, GDove, SZabel, MElz, SSeifert, RBuschauer, A Acylguanidines as bioisosteres of guanidines: NG-acylated imidazolylpropylguanidines, a new class of histamine H2 receptor agonists. J Med Chem 51:7193-204 (2009)  
Target
Name:
Histamine H2 receptor
Synonyms:
Gastric receptor I HISTAMINE H2 HRH2_CAVPO | Histamine H2-Gs alpha S
Type:
G Protein-Coupled Receptor (GPCR)
Mol. Mass.:
40567.22
Organism:
Cavia porcellus (domestic guinea pig)
Description:
For the H2 receptor-binding assays, guinea pig striatum was used.
Residue:
359
  
Inhibitor
Name:
BDBM86745
Synonyms:
UR-AK51
Type:
Small organic molecule
Emp. Form.:
C16H21N5O
Mol. Mass.:
299.3708
SMILES:
NC(NC(=O)CCc1ccccc1)=NCCCc1cnc[nH]1
: