Target
Sodium-dependent serotonin transporter
Ligand
BDBM50276643
Substrate
Meas. Tech.
ChEMBL_541287 (CHEMBL1031546)
Ki
2.8±n/a nM
Citation
 Voelker, TXia, HFandrick, KJohnson, RJanowsky, ACashman, JR 2,5-Disubstituted tetrahydrofurans as selective serotonin re-uptake inhibitors. Bioorg Med Chem 17:2047-68 (2009)  
Target
Name:
Sodium-dependent serotonin transporter
Synonyms:
5-HT Transporter 5HTT SC6A4_HUMAN SLC6A4 Serotonin transporter (5HTT) Sodium-dependent serotonin transporter (SERT) | Solute carrier family 6 member 4
Type:
Multi-pass membrane protein
Mol. Mass.:
70322.51
Organism:
Homo sapiens (Human)
Description:
P31645
Residue:
630
  
Inhibitor
Name:
BDBM50276643
Synonyms:
CHEMBL459367 | cis-2-Aminomethyl-5-((2''-methoxy-5''-fluorophenyl)-3'-propyl)tetrahydrofuran
Type:
Small organic molecule
Emp. Form.:
C15H22FNO2
Mol. Mass.:
267.3391
SMILES:
COc1ccc(F)cc1CCC[C@@H]1CC[C@H](CN)O1
: