Target
Tyrosine-protein kinase JAK1
Ligand
BDBM4313
Substrate
Meas. Tech.
ChEMBL_542085 (CHEMBL1016954)
IC50
3380±n/a nM
Citation
 Changelian, PSFlanagan, MEBall, DJKent, CRMagnuson, KSMartin, WHRizzuti, BJSawyer, PSPerry, BDBrissette, WHMcCurdy, SPKudlacz, EMConklyn, MJElliott, EAKoslov, ERFisher, MBStrelevitz, TJYoon, KWhipple, DASun, JMunchhof, MJDoty, JLCasavant, JMBlumenkopf, TAHines, MBrown, MFLillie, BMSubramanyam, CShang-Poa, CMilici, AJBeckius, GEMoyer, JDSu, CWoodworth, TGGaweco, ASBeals, CRLittman, BHFisher, DASmith, JFZagouras, PMagna, HASaltarelli, MJJohnson, KSNelms, LFDes Etages, SGHayes, LSKawabata, TTFinco-Kent, DBaker, DLLarson, MSi, MSPaniagua, RHiggins, JHolm, BReitz, BZhou, YJMorris, REO'Shea, JJBorie, DC Prevention of organ allograft rejection by a specific Janus kinase 3 inhibitor. Science 302:875-878 (2003)  
Target
Name:
Tyrosine-protein kinase JAK1
Synonyms:
JAK-1 JAK1A JAK1_HUMAN Janus kinase 1 (JAK1) | Janus kinase 1 JAK1
Type:
Protein
Mol. Mass.:
133293.73
Organism:
Homo sapiens (Human)
Description:
P23458
Residue:
1154
  
Inhibitor
Name:
BDBM4313
Synonyms:
(2E)-N-benzyl-2-cyano-3-(3,4-dihydroxyphenyl)prop-2-enamide AG-490 Tyrphostin AG 490 Tyrphostin deriv. 42
Type:
Small organic molecule
Emp. Form.:
C17H14N2O3
Mol. Mass.:
294.3047
SMILES:
Oc1ccc(\C=C(/C#N)C(=O)NCc2ccccc2)cc1O
: