Target
Sodium/glucose cotransporter 2
Ligand
BDBM50257797
Substrate
Meas. Tech.
ChEMBL_566717 (CHEMBL961709)
EC50
>2±n/a nM
Citation
 Washburn, WN Development of the renal glucose reabsorption inhibitors: a new mechanism for the pharmacotherapy of diabetes mellitus type 2. J Med Chem 52:1785-94 (2009)  
Target
Name:
Sodium/glucose cotransporter 2
Synonyms:
Na(+)/glucose cotransporter 2 SGLT2 Sodium-Dependent Glucose Cotransporter 2 (SGLT2) Solute carrier family 5 member 2
Type:
Protein
Mol. Mass.:
72902.00
Organism:
Homo sapiens (Human)
Description:
P31639
Residue:
672
  
Inhibitor
Name:
BDBM50257797
Synonyms:
(2S,3R,4R,5S,6R)-2-(2-(4-ethylbenzyl)phenyl)-6-(hydroxymethyl)tetrahydro-2H-pyran-3,4,5-triol | CHEMBL494396
Type:
Small organic molecule
Emp. Form.:
C21H26O5
Mol. Mass.:
358.4281
SMILES:
CCc1ccc(Cc2ccccc2[C@@H]2O[C@H](CO)[C@@H](O)[C@H](O)[C@H]2O)cc1
: