Target
Adenosine receptor A2a
Ligand
BDBM50009680
Substrate
Meas. Tech.
ChEMBL_566530 (CHEMBL955116)
Ki
1800±n/a nM
Citation
 Lambertucci, CAntonini, IBuccioni, MDal Ben, DKachare, DDVolpini, RKlotz, KNCristalli, G 8-Bromo-9-alkyl adenine derivatives as tools for developing new adenosine A2A and A2B receptors ligands. Bioorg Med Chem 17:2812-22 (2009)  
Target
Name:
Adenosine receptor A2a
Synonyms:
A2A adenosine receptor (hA2A) ADENOSINE A2 ADORA2 Adenosine A2A receptor (A2AAR)
Type:
G Protein-Coupled Receptor (GPCR)
Mol. Mass.:
44716.46
Organism:
Homo sapiens (Human)
Description:
P29274
Residue:
412
  
Inhibitor
Name:
BDBM50009680
Synonyms:
6-Amino-9-cyclopentyl-9H-purine 9-Cyclopentyl-9H-purin-6-ylamine | CHEMBL294590
Type:
Small organic molecule
Emp. Form.:
C10H13N5
Mol. Mass.:
203.2437
SMILES:
Nc1ncnc2n(cnc12)C1CCCC1
: