Target
Delta-type opioid receptor
Ligand
BDBM50241341
Substrate
Meas. Tech.
ChEMBL_564843 (CHEMBL955070)
Ki
38±n/a nM
Citation
 Wentland, MPLou, RLu, QBu, YDenhardt, CJin, JGanorkar, RVanAlstine, MAGuo, CCohen, DJBidlack, JM Syntheses of novel high affinity ligands for opioid receptors. Bioorg Med Chem Lett 19:2289-94 (2009)  
Target
Name:
Delta-type opioid receptor
Synonyms:
D-OR-1 Delta opioid receptor OPIATE Delta OPRD1 OPRK1 | opioid receptor, delta 1
Type:
G Protein-Coupled Receptor (GPCR)
Mol. Mass.:
40382.98
Organism:
Homo sapiens (Human)
Description:
Competition binding assays were carried out using membrane preparations from transfected HN9.10 cells that constitutively expressed the delta opioid receptor.
Residue:
372
  
Inhibitor
Name:
BDBM50241341
Synonyms:
(-)-(5R)-4,5-Epoxy-3-hydroxy-9alpha-methylmorphinan-6-one 4,5-Epoxy-3-hydroxy-17-methylmorphinan-6-one 6-Deoxy-7,8-dihydro-6-oxomorphine CHEMBL398707 Dihydromorphinone HYDROMORPHONE Hydromorphone Hydrochloride | Idromorfone
Type:
Small organic molecule
Emp. Form.:
C17H19NO3
Mol. Mass.:
285.3377
SMILES:
CN1CC[C@@]23[C@H]4Oc5c2c(C[C@@H]1[C@@H]3CCC4=O)ccc5O
: