Target
Aurora kinase A
Ligand
BDBM50162083
Substrate
Meas. Tech.
ChEMBL_501648 (CHEMBL993738)
Ki
58±n/a nM
Citation
 Pollard, JRMortimore, M Discovery and development of aurora kinase inhibitors as anticancer agents. J Med Chem 52:2629-51 (2009)  
Target
Name:
Aurora kinase A
Synonyms:
AIK ARK1 AURKA AYK1 Aurora kinase A (AURA) Aurora kinase A (Aurora A) Aurora-related kinase 1 BTAK Breast-tumor-amplified kinase STK15 Serine/threonine kinase 15 Serine/threonine-protein kinase aurora A hARK1
Type:
Serine/threonine-protein kinase
Mol. Mass.:
45830.98
Organism:
Homo sapiens (Human)
Description:
O14965
Residue:
403
  
Inhibitor
Name:
BDBM50162083
Synonyms:
(5-Methyl-1H-pyrazol-3-yl)-(2-phenyl-quinazolin-4-yl)-amine CHEMBL359482 N-(5-METHYL-1H-PYRAZOL-3-YL)-2-PHENYLQUINAZOLIN-4-AMINE
Type:
Small organic molecule
Emp. Form.:
C18H15N5
Mol. Mass.:
301.3452
SMILES:
Cc1cc(Nc2nc(nc3ccccc23)-c2ccccc2)[nH]n1
: