Target
Aurora kinase B
Ligand
BDBM12405
Substrate
Meas. Tech.
ChEMBL_501649 (CHEMBL993739)
IC50
1±n/a nM
Citation
 Pollard, JRMortimore, M Discovery and development of aurora kinase inhibitors as anticancer agents. J Med Chem 52:2629-51 (2009)  
Target
Name:
Aurora kinase B
Synonyms:
AIK2 AIM1 ARK2 AURKB_HUMAN Aurora B-INCENP Aurora kinase B (AURKB) STK-1 STK12 Serine/threonine-protein kinase aurora B
Type:
Protein
Mol. Mass.:
39327.72
Organism:
Homo sapiens (Human)
Description:
Q96GD4
Residue:
344
  
Inhibitor
Name:
BDBM12405
Synonyms:
CHEMBL381724 quinazoline deriv. 3
Type:
Small organic molecule
Emp. Form.:
C27H29N7O4
Mol. Mass.:
515.5637
SMILES:
COc1cc2c(Nc3cnc(NC(=O)c4ccccc4)nc3)ncnc2cc1OCCCN1CCOCC1
: