Target
Tyrosine-protein kinase JAK2
Ligand
BDBM27087
Substrate
Meas. Tech.
ChEMBL_501662 (CHEMBL981410)
IC50
1±n/a nM
Citation
 Pollard, JRMortimore, M Discovery and development of aurora kinase inhibitors as anticancer agents. J Med Chem 52:2629-51 (2009)  
Target
Name:
Tyrosine-protein kinase JAK2
Synonyms:
JAK-2 JAK2_HUMAN Janus kinase 2 (JAK2) | Janus kinase 2 (a protein tyrosine kinase)
Type:
Protein
Mol. Mass.:
130684.68
Organism:
Homo sapiens (Human)
Description:
O60674
Residue:
1132
  
Inhibitor
Name:
BDBM27087
Synonyms:
3-cyclopropyl-1-{3-[5-(morpholin-4-ylmethyl)-1H-1,3-benzodiazol-2-yl]-1H-pyrazol-4-yl}urea | pyrazole-benzimidazole urea analogue, 16
Type:
Small organic molecule
Emp. Form.:
C19H23N7O2
Mol. Mass.:
381.4316
SMILES:
O=C(NC1CC1)Nc1c[nH]nc1-c1nc2ccc(CN3CCOCC3)cc2[nH]1
: