Target
Tyrosine-protein kinase JAK3
Ligand
BDBM27087
Substrate
Meas. Tech.
ChEMBL_501693 (CHEMBL981441)
IC50
1±n/a nM
Citation
 Pollard, JRMortimore, M Discovery and development of aurora kinase inhibitors as anticancer agents. J Med Chem 52:2629-51 (2009)  
Target
Name:
Tyrosine-protein kinase JAK3
Synonyms:
JAK-3 JAK3_HUMAN Janus kinase 3 (JAK3) L-JAK | Leukocyte janus kinase
Type:
Protein
Mol. Mass.:
125111.08
Organism:
Homo sapiens (Human)
Description:
P52333
Residue:
1124
  
Inhibitor
Name:
BDBM27087
Synonyms:
3-cyclopropyl-1-{3-[5-(morpholin-4-ylmethyl)-1H-1,3-benzodiazol-2-yl]-1H-pyrazol-4-yl}urea | pyrazole-benzimidazole urea analogue, 16
Type:
Small organic molecule
Emp. Form.:
C19H23N7O2
Mol. Mass.:
381.4316
SMILES:
O=C(NC1CC1)Nc1c[nH]nc1-c1nc2ccc(CN3CCOCC3)cc2[nH]1
: