Target
Aurora kinase A
Ligand
BDBM26274
Substrate
Meas. Tech.
ChEMBL_501648 (CHEMBL993738)
IC50
450±n/a nM
Citation
 Pollard, JRMortimore, M Discovery and development of aurora kinase inhibitors as anticancer agents. J Med Chem 52:2629-51 (2009)  
Target
Name:
Aurora kinase A
Synonyms:
AIK ARK1 AURKA AYK1 Aurora kinase A (AURA) Aurora kinase A (Aurora A) Aurora-related kinase 1 BTAK Breast-tumor-amplified kinase STK15 Serine/threonine kinase 15 Serine/threonine-protein kinase aurora A hARK1
Type:
Serine/threonine-protein kinase
Mol. Mass.:
45830.98
Organism:
Homo sapiens (Human)
Description:
O14965
Residue:
403
  
Inhibitor
Name:
BDBM26274
Synonyms:
CHEMBL216769 pyrazoloquinazoline deriv., 8
Type:
Small organic molecule
Emp. Form.:
C29H34FN7O4
Mol. Mass.:
563.6232
SMILES:
COc1cc2c(Nc3cc(CC(=O)Nc4cccc(F)c4)n[nH]3)ncnc2cc1OCCCN1CCC(CO)CC1
: