Target
Aurora kinase A
Ligand
BDBM26309
Substrate
Meas. Tech.
ChEMBL_501648 (CHEMBL993738)
IC50
3200±n/a nM
Citation
 Pollard, JRMortimore, M Discovery and development of aurora kinase inhibitors as anticancer agents. J Med Chem 52:2629-51 (2009)  
Target
Name:
Aurora kinase A
Synonyms:
AIK ARK-1 AURA AURKA_HUMAN Aurora 2 Aurora kinase A (AURKA) Aurora kinase A (Aurora-2) Aurora/IPL1-related kinase 1 Breast tumor-amplified kinase IAK1 STK15 GN Serine/threonine kinase 15 Serine/threonine-protein kinase 6 Serine/threonine-protein kinase aurora-A aurora-2 | hARK1
Type:
Serine/threonine-protein kinase
Mol. Mass.:
45830.98
Organism:
Homo sapiens (Human)
Description:
O14965
Residue:
403
  
Inhibitor
Name:
BDBM26309
Synonyms:
CHEMBL459888 thieno[3,2-d]pyrimidine analogue, 1
Type:
Small organic molecule
Emp. Form.:
C22H17F3N4OS
Mol. Mass.:
442.457
SMILES:
FC(F)(F)c1cccc(c1)C(=O)Nc1ccc(CCNc2ncnc3ccsc23)cc1
: