Target
Aurora kinase A
Ligand
BDBM26314
Substrate
Meas. Tech.
ChEMBL_501648 (CHEMBL993738)
IC50
250±n/a nM
Citation
 Pollard, JRMortimore, M Discovery and development of aurora kinase inhibitors as anticancer agents. J Med Chem 52:2629-51 (2009)  
Target
Name:
Aurora kinase A
Synonyms:
AIK ARK1 AURKA AYK1 Aurora kinase A (AURA) Aurora kinase A (Aurora A) Aurora-related kinase 1 BTAK Breast-tumor-amplified kinase STK15 Serine/threonine kinase 15 Serine/threonine-protein kinase aurora A hARK1
Type:
Serine/threonine-protein kinase
Mol. Mass.:
45830.98
Organism:
Homo sapiens (Human)
Description:
O14965
Residue:
403
  
Inhibitor
Name:
BDBM26314
Synonyms:
3-[1-(2-{thieno[3,2-d]pyrimidin-4-ylamino}ethyl)-1H-1,2,3-triazol-4-yl]-1-[3-(trifluoromethyl)phenyl]urea thieno[3,2-d]pyrimidine analogue, 9
Type:
Small organic molecule
Emp. Form.:
C18H15F3N8OS
Mol. Mass.:
448.425
SMILES:
FC(F)(F)c1cccc(NC(=O)Nc2cn(CCNc3ncnc4ccsc34)nn2)c1
: