Target
Aurora kinase A
Ligand
BDBM50277639
Substrate
Meas. Tech.
ChEMBL_501648 (CHEMBL993738)
IC50
1.6±n/a nM
Citation
 Pollard, JRMortimore, M Discovery and development of aurora kinase inhibitors as anticancer agents. J Med Chem 52:2629-51 (2009)  
Target
Name:
Aurora kinase A
Synonyms:
AIK ARK1 AURKA AYK1 Aurora kinase A (AURA) Aurora kinase A (Aurora A) Aurora-related kinase 1 BTAK Breast-tumor-amplified kinase STK15 Serine/threonine kinase 15 Serine/threonine-protein kinase aurora A hARK1
Type:
Serine/threonine-protein kinase
Mol. Mass.:
45830.98
Organism:
Homo sapiens (Human)
Description:
O14965
Residue:
403
  
Inhibitor
Name:
BDBM50277639
Synonyms:
CHEMBL484609 | N-(4-(4-(5-methyl-1H-pyrazol-3-ylamino)-6-(4-methylpiperazin-1-yl)pyrimidin-2-ylthio)phenyl)propionamide
Type:
Small organic molecule
Emp. Form.:
C22H28N8OS
Mol. Mass.:
452.576
SMILES:
CCC(=O)Nc1ccc(Sc2nc(Nc3cc(C)n[nH]3)cc(n2)N2CCN(C)CC2)cc1
: