Target
Carbonic anhydrase 14
Ligand
BDBM11035
Substrate
Meas. Tech.
ChEMBL_544670 (CHEMBL1009247)
Ki
24±n/a nM
Citation
 Thiry, ARolin, SVullo, DFrankart, AScozzafava, ADogné, JMWouters, JSupuran, CTMasereel, B Indanesulfonamides as carbonic anhydrase inhibitors and anticonvulsant agents: structure-activity relationship and pharmacological evaluation. Eur J Med Chem 43:2853-60 (2008)  
Target
Name:
Carbonic anhydrase 14
Synonyms:
CA-XIV CAH14_HUMAN Carbonic Anhydrase XIV Carbonic anhydrase 14 Carbonic anhydrase XIV (CA XIV)
Type:
Enzyme
Mol. Mass.:
37665.67
Organism:
Homo sapiens (Human)
Description:
Human (cloned) isozyme.
Residue:
337
  
Inhibitor
Name:
BDBM11035
Synonyms:
2,3,4,5,6-pentafluoro-N-(5-sulfamoyl-2,3-dihydro-1H-inden-2-yl)benzamide CHEMBL184361 | Indanesulfonamide Derivative 12c
Type:
Small organic molecule
Emp. Form.:
C16H11F5N2O3S
Mol. Mass.:
406.327
SMILES:
NS(=O)(=O)c1ccc2CC(Cc2c1)NC(=O)c1c(F)c(F)c(F)c(F)c1F
: