Target
Carbonic anhydrase 14
Ligand
BDBM50266093
Substrate
Meas. Tech.
ChEMBL_544670 (CHEMBL1009247)
Ki
1030±n/a nM
Citation
 Thiry, ARolin, SVullo, DFrankart, AScozzafava, ADogné, JMWouters, JSupuran, CTMasereel, B Indanesulfonamides as carbonic anhydrase inhibitors and anticonvulsant agents: structure-activity relationship and pharmacological evaluation. Eur J Med Chem 43:2853-60 (2008)  
Target
Name:
Carbonic anhydrase 14
Synonyms:
CA-XIV CAH14_HUMAN Carbonic Anhydrase XIV Carbonic anhydrase 14 Carbonic anhydrase XIV (CA XIV)
Type:
Enzyme
Mol. Mass.:
37665.67
Organism:
Homo sapiens (Human)
Description:
Human (cloned) isozyme.
Residue:
337
  
Inhibitor
Name:
BDBM50266093
Synonyms:
CHEMBL456889 | N-(5-sulfamoyl-2,3-dihydro-1H-inden-1-yl)decanamide
Type:
Small organic molecule
Emp. Form.:
C19H30N2O3S
Mol. Mass.:
366.518
SMILES:
CCCCCCCCCC(=O)NC1CCc2cc(ccc12)S(N)(=O)=O
: