Target
Carbonic anhydrase 7
Ligand
BDBM11030
Substrate
Meas. Tech.
ChEMBL_544671 (CHEMBL1009248)
Ki
1.7±n/a nM
Citation
 Thiry, ARolin, SVullo, DFrankart, AScozzafava, ADogné, JMWouters, JSupuran, CTMasereel, B Indanesulfonamides as carbonic anhydrase inhibitors and anticonvulsant agents: structure-activity relationship and pharmacological evaluation. Eur J Med Chem 43:2853-60 (2008)  
Target
Name:
Carbonic anhydrase 7
Synonyms:
CA-VII CAH7_HUMAN Carbonic anhydrase Carbonic anhydrase VII (CA VII)
Type:
Enzyme
Mol. Mass.:
29664.11
Organism:
Homo sapiens (Human)
Description:
Human cloned isozyme.
Residue:
264
  
Inhibitor
Name:
BDBM11030
Synonyms:
1-valproylamido-5-sulfonamidoindane CHEMBL204941 | Indanesulfonamide Derivative 11a
Type:
Small organic molecule
Emp. Form.:
C17H26N2O3S
Mol. Mass.:
338.465
SMILES:
CCCC(CCC)C(=O)NC1CCc2cc(ccc12)S(N)(=O)=O
: