Target
Insulin-like growth factor 1 receptor
Ligand
BDBM27799
Substrate
Meas. Tech.
ChEMBL_540379 (CHEMBL1025722)
IC50
1±n/a nM
Citation
 Chamberlain, SDRedman, AMPatnaik, SBrickhouse, KChew, YCDeanda, FGerding, RLei, HMoorthy, GPatrick, MStevens, KLWilson, JWBrad Shotwell, J Optimization of a series of 4,6-bis-anilino-1H-pyrrolo[2,3-d]pyrimidine inhibitors of IGF-1R: elimination of an acid-mediated decomposition pathway. Bioorg Med Chem Lett 19:373-7 (2008)  
Target
Name:
Insulin-like growth factor 1 receptor
Synonyms:
CD_antigen=CD221 IGF1R Insulin-like growth factor 1 receptor (IGF1R) Insulin-like growth factor 1 receptor alpha chain Insulin-like growth factor I receptor | Insulin-like growth factor receptor (IGFR)
Type:
Protein
Mol. Mass.:
154776.79
Organism:
Homo sapiens (Human)
Description:
P08069
Residue:
1367
  
Inhibitor
Name:
BDBM27799
Synonyms:
2-{[2-({1-[2-(dimethylamino)acetyl]-5-methoxy-2,3-dihydro-1H-indol-6-yl}amino)-7H-pyrrolo[2,3-d]pyrimidin-4-yl]amino}-6-fluorobenzamide pyrrolo[2,3-d]pyrimidine deriv., 23
Type:
Small organic molecule
Emp. Form.:
C26H27FN8O3
Mol. Mass.:
518.5428
SMILES:
COc1cc2CCN(C(=O)CN(C)C)c2cc1Nc1nc(Nc2cccc(F)c2C(N)=O)c2cc[nH]c2n1
: