Target
Histamine H3 receptor
Ligand
BDBM50268453
Substrate
Meas. Tech.
ChEMBL_523452 (CHEMBL1008304)
EC50
405±n/a nM
Citation
 Pierson, PDFettes, AFreichel, CGatti-McArthur, SHertel, CHuwyler, JMohr, PNakagawa, TNettekoven, MPlancher, JMRaab, SRichter, HRoche, ORodríguez Sarmiento, RMSchmitt, MSchuler, FTakahashi, TTaylor, SUllmer, CWiegand, R 5-hydroxyindole-2-carboxylic acid amides: novel histamine-3 receptor inverse agonists for the treatment of obesity. J Med Chem 52:3855-68 (2009)  
Target
Name:
Histamine H3 receptor
Synonyms:
G-protein coupled receptor 97 HH3R HRH3 Histamine H3 receptor (H3) Histamine receptor (H3 and H4)
Type:
G Protein-Coupled Receptor (GPCR)
Mol. Mass.:
48691.47
Organism:
Homo sapiens (Human)
Description:
Binding assays were using CHO cells stably expressing hH3R receptors.
Residue:
445
  
Inhibitor
Name:
BDBM50268453
Synonyms:
(5-(1-isopropylpiperidin-4-yloxy)-2-methyl-1H-indol-3-yl)(morpholino)methanone | CHEMBL496814
Type:
Small organic molecule
Emp. Form.:
C22H31N3O3
Mol. Mass.:
385.4998
SMILES:
CC(C)N1CCC(CC1)Oc1ccc2[nH]c(C)c(C(=O)N3CCOCC3)c2c1
: