Target
P2Y purinoceptor 12
Ligand
BDBM50269016
Substrate
Meas. Tech.
ChEMBL_523462 (CHEMBL995340)
Ki
>10000±n/a nM
Citation
 Baqi, YAtzler, KKöse, MGlänzel, MMüller, CE High-affinity, non-nucleotide-derived competitive antagonists of platelet P2Y12 receptors. J Med Chem 52:3784-93 (2009)  
Target
Name:
P2Y purinoceptor 12
Synonyms:
ADP-glucose receptor HORK3 P2T(AC) P2Y(AC) P2Y(cyc) P2Y12 platelet ADP receptor Purinergic receptor P2Y12 | SP1999
Type:
Enzyme
Mol. Mass.:
39458.48
Organism:
Homo sapiens (Human)
Description:
Q9H244
Residue:
342
  
Inhibitor
Name:
BDBM50269016
Synonyms:
CHEMBL497001 | aloin
Type:
Small organic molecule
Emp. Form.:
C21H22O9
Mol. Mass.:
418.394
SMILES:
OC[C@H]1O[C@H]([C@H](O)[C@@H](O)[C@@H]1O)C1c2cccc(O)c2C(=O)c2c(O)cc(CO)cc12
: