Target
Adenosine receptor A2a
Ligand
BDBM50268149
Substrate
Meas. Tech.
ChEMBL_520179 (CHEMBL948831)
Ki
144±n/a nM
Citation
 Borrmann, THinz, SBertarelli, DCLi, WFlorin, NCScheiff, ABMüller, CE 1-alkyl-8-(piperazine-1-sulfonyl)phenylxanthines: development and characterization of adenosine A2B receptor antagonists and a new radioligand with subnanomolar affinity and subtype specificity. J Med Chem 52:3994-4006 (2009)  
Target
Name:
Adenosine receptor A2a
Synonyms:
A2A adenosine receptor (hA2A) ADENOSINE A2 ADORA2 Adenosine A2A receptor (A2AAR)
Type:
G Protein-Coupled Receptor (GPCR)
Mol. Mass.:
44716.46
Organism:
Homo sapiens (Human)
Description:
P29274
Residue:
412
  
Inhibitor
Name:
BDBM50268149
Synonyms:
1-Ethyl-8-(4-(4-(3-fluorobenzyl)piperazine-1-sulfonyl)phenyl)-3,7-dihydropurine-2,6-dione | CHEMBL484899
Type:
Small organic molecule
Emp. Form.:
C24H25FN6O4S
Mol. Mass.:
512.557
SMILES:
CCn1c(=O)[nH]c2nc([nH]c2c1=O)-c1ccc(cc1)S(=O)(=O)N1CCN(Cc2cccc(F)c2)CC1
: