Target
Adenosine receptor A3
Ligand
BDBM50268150
Substrate
Meas. Tech.
ChEMBL_520181 (CHEMBL948833)
Ki
>1000±n/a nM
Citation
 Borrmann, THinz, SBertarelli, DCLi, WFlorin, NCScheiff, ABMüller, CE 1-alkyl-8-(piperazine-1-sulfonyl)phenylxanthines: development and characterization of adenosine A2B receptor antagonists and a new radioligand with subnanomolar affinity and subtype specificity. J Med Chem 52:3994-4006 (2009)  
Target
Name:
Adenosine receptor A3
Synonyms:
A3 adenosine receptor (hA3) ADORA3 | Adenosine A3 receptor (A3AR)
Type:
G Protein-Coupled Receptor (GPCR)
Mol. Mass.:
36197.32
Organism:
Homo sapiens (Human)
Description:
P0DMS8
Residue:
318
  
Inhibitor
Name:
BDBM50268150
Synonyms:
8-(4-(4-(3-Fluorobenzyl)piperazine-1-sulfonyl)phenyl)-1-propyl-3,7-dihydropurine-2,6-dione | CHEMBL484900
Type:
Small organic molecule
Emp. Form.:
C25H27FN6O4S
Mol. Mass.:
526.583
SMILES:
CCCn1c(=O)[nH]c2nc([nH]c2c1=O)-c1ccc(cc1)S(=O)(=O)N1CCN(Cc2cccc(F)c2)CC1
: