Target
Adenosine receptor A2a
Ligand
BDBM50236738
Substrate
Meas. Tech.
ChEMBL_520167 (CHEMBL947855)
Ki
3280±n/a nM
Citation
 Borrmann, THinz, SBertarelli, DCLi, WFlorin, NCScheiff, ABMüller, CE 1-alkyl-8-(piperazine-1-sulfonyl)phenylxanthines: development and characterization of adenosine A2B receptor antagonists and a new radioligand with subnanomolar affinity and subtype specificity. J Med Chem 52:3994-4006 (2009)  
Target
Name:
Adenosine receptor A2a
Synonyms:
A2A adenosine receptor (hA2A) ADENOSINE A2 ADORA2 Adenosine A2A receptor (A2AAR)
Type:
G Protein-Coupled Receptor (GPCR)
Mol. Mass.:
44716.46
Organism:
Homo sapiens (Human)
Description:
P29274
Residue:
412
  
Inhibitor
Name:
BDBM50236738
Synonyms:
3-ethyl-1-propyl-8-(1-(3-(trifluoromethyl)benzyl)-1H-pyrazol-4-yl)-1H-purine-2,6(3H,7H)-dione CHEMBL260933 | CVT-6883
Type:
Small organic molecule
Emp. Form.:
C21H21F3N6O2
Mol. Mass.:
446.4256
SMILES:
CCCn1c(=O)n(CC)c2nc([nH]c2c1=O)-c1cnn(Cc2cccc(c2)C(F)(F)F)c1
: