Target
Neuronal acetylcholine receptor subunit alpha-4
Ligand
BDBM50279371
Substrate
Meas. Tech.
ChEMBL_546018 (CHEMBL1028496)
Ki
0.2±n/a nM
Citation
 Bunnelle, WHTietje, KRFrost, JMPeters, DJi, JLi, TScanio, MJShi, LAnderson, DJDyhring, TGrønlien, JHWeen, HThorin-Hagene, KMeyer, MD Octahydropyrrolo[3,4-c]pyrrole: a diamine scaffold for construction of either alpha4beta2 or alpha7-selective nicotinic acetylcholine receptor (nAChR) ligands. Substitutions that switch subtype selectivity. J Med Chem 52:4126-41 (2009)  
Target
Name:
Neuronal acetylcholine receptor subunit alpha-4
Synonyms:
ACHA4_RAT Cholinergic, Nicotinic Alpha4Beta2 Chrna4 Neuronal acetylcholine receptor (alpha4beta2 nAChR) Neuronal acetylcholine receptor subunit alpha 4 beta 2 | Neuronal acetylcholine receptor subunit alpha-4
Type:
Enzyme
Mol. Mass.:
70196.44
Organism:
Rattus norvegicus (Rat)
Description:
P09483
Residue:
630
  
Inhibitor
Name:
BDBM50279371
Synonyms:
CHEMBL484831 | cis-2-(6-Chloro-3-pyridinyl)octahydropyrrolo[3,4-c]pyrrole Hydrochloride
Type:
Small organic molecule
Emp. Form.:
C11H14ClN3
Mol. Mass.:
223.702
SMILES:
Clc1ccc(cn1)N1C[C@@H]2CNC[C@@H]2C1
: