Target
Glucocorticoid receptor
Ligand
BDBM18207
Substrate
Meas. Tech.
ChEMBL_499970 (CHEMBL1019340)
Ki
1.1±n/a nM
Citation
 Yang, BVVaccaro, WDoweyko, AMDoweyko, LMHuynh, TTortolani, DNadler, SGMcKay, LSomerville, JHolloway, DAHabte, SWeinstein, DSBarrish, JC Discovery of novel dihydro-9,10-ethano-anthracene carboxamides as glucocorticoid receptor modulators. Bioorg Med Chem Lett 19:2139-43 (2009)  
Target
Name:
Glucocorticoid receptor
Synonyms:
GCR_HUMAN GRL Glucocorticoid receptor (GRFP) Nuclear receptor subfamily 3 group C member 1
Type:
Enzyme
Mol. Mass.:
85656.87
Organism:
Homo sapiens (Human)
Description:
P04150
Residue:
777
  
Inhibitor
Name:
BDBM18207
Synonyms:
(1R,2S,10S,11S,13R,14R,15S,17S)-1-fluoro-14,17-dihydroxy-14-(2-hydroxyacetyl)-2,13,15-trimethyltetracyclo[8.7.0.0^{2,7}.0^{11,15}]heptadeca-3,6-dien-5-one US11554172, Compound Dexamethasone dexamethasone (tetramethyl-rhodamine conjugated )
Type:
Steroid
Emp. Form.:
C22H29FO5
Mol. Mass.:
392.4611
SMILES:
[H][C@@]12C[C@@H](C)[C@](O)(C(=O)CO)[C@@]1(C)C[C@H](O)[C@@]1(F)[C@@]2([H])CCC2=CC(=O)C=C[C@]12C
: