Target
Insulin-like growth factor 1 receptor
Ligand
BDBM50293528
Substrate
Meas. Tech.
ChEMBL_570760 (CHEMBL1026935)
IC50
2198±n/a nM
Citation
 Patnaik, SStevens, KLGerding, RDeanda, FShotwell, JBTang, JHamajima, TNakamura, HLeesnitzer, MAHassell, AMShewchuck, LMKumar, RLei, HChamberlain, SD Discovery of 3,5-disubstituted-1H-pyrrolo[2,3-b]pyridines as potent inhibitors of the insulin-like growth factor-1 receptor (IGF-1R) tyrosine kinase. Bioorg Med Chem Lett 19:3136-40 (2009)  
Target
Name:
Insulin-like growth factor 1 receptor
Synonyms:
CD_antigen=CD221 IGF1R Insulin-like growth factor 1 receptor (IGF1R) Insulin-like growth factor 1 receptor alpha chain Insulin-like growth factor I receptor | Insulin-like growth factor receptor (IGFR)
Type:
Protein
Mol. Mass.:
154776.79
Organism:
Homo sapiens (Human)
Description:
P08069
Residue:
1367
  
Inhibitor
Name:
BDBM50293528
Synonyms:
1-(3-(5-(3,4-dimethoxyphenyl)-1H-pyrrolo[2,3-b]pyridin-3-yl)phenyl)-3-(2-fluoro-4-(trifluoromethyl)phenyl)urea | CHEMBL558867
Type:
Small organic molecule
Emp. Form.:
C29H22F4N4O3
Mol. Mass.:
550.5036
SMILES:
COc1ccc(cc1OC)-c1cnc2[nH]cc(-c3cccc(NC(=O)Nc4ccc(cc4F)C(F)(F)F)c3)c2c1
: