Target
Insulin-like growth factor 1 receptor
Ligand
BDBM50378035
Substrate
Meas. Tech.
ChEMBL_570760 (CHEMBL1026935)
IC50
251±n/a nM
Citation
 Patnaik, SStevens, KLGerding, RDeanda, FShotwell, JBTang, JHamajima, TNakamura, HLeesnitzer, MAHassell, AMShewchuck, LMKumar, RLei, HChamberlain, SD Discovery of 3,5-disubstituted-1H-pyrrolo[2,3-b]pyridines as potent inhibitors of the insulin-like growth factor-1 receptor (IGF-1R) tyrosine kinase. Bioorg Med Chem Lett 19:3136-40 (2009)  
Target
Name:
Insulin-like growth factor 1 receptor
Synonyms:
CD_antigen=CD221 IGF1R Insulin-like growth factor 1 receptor (IGF1R) Insulin-like growth factor 1 receptor alpha chain Insulin-like growth factor I receptor | Insulin-like growth factor receptor (IGFR)
Type:
Protein
Mol. Mass.:
154776.79
Organism:
Homo sapiens (Human)
Description:
P08069
Residue:
1367
  
Inhibitor
Name:
BDBM50378035
Synonyms:
CHEMBL563463
Type:
Small organic molecule
Emp. Form.:
C30H22N4O3
Mol. Mass.:
486.5207
SMILES:
O=C(Nc1cccc(c1)-c1c[nH]c2ncc(cc12)-c1ccoc1)Nc1ccccc1Oc1ccccc1
: