Target
Insulin-like growth factor 1 receptor
Ligand
BDBM50293551
Substrate
Meas. Tech.
ChEMBL_570761 (CHEMBL1026936)
IC50
385±n/a nM
Citation
 Patnaik, SStevens, KLGerding, RDeanda, FShotwell, JBTang, JHamajima, TNakamura, HLeesnitzer, MAHassell, AMShewchuck, LMKumar, RLei, HChamberlain, SD Discovery of 3,5-disubstituted-1H-pyrrolo[2,3-b]pyridines as potent inhibitors of the insulin-like growth factor-1 receptor (IGF-1R) tyrosine kinase. Bioorg Med Chem Lett 19:3136-40 (2009)  
Target
Name:
Insulin-like growth factor 1 receptor
Synonyms:
CD_antigen=CD221 IGF1R Insulin-like growth factor 1 receptor (IGF1R) Insulin-like growth factor 1 receptor alpha chain Insulin-like growth factor I receptor | Insulin-like growth factor receptor (IGFR)
Type:
Protein
Mol. Mass.:
154776.79
Organism:
Homo sapiens (Human)
Description:
P08069
Residue:
1367
  
Inhibitor
Name:
BDBM50293551
Synonyms:
3-{3-[3-(3-Biphenyl-2-yl-ureido)-phenyl]-1H-pyrrolo[2,3-b]pyridin-5-yl}-N,N-dimethyl-benzamide | CHEMBL554351
Type:
Small organic molecule
Emp. Form.:
C35H29N5O2
Mol. Mass.:
551.6371
SMILES:
CN(C)C(=O)c1cccc(c1)-c1cnc2[nH]cc(-c3cccc(NC(=O)Nc4ccccc4-c4ccccc4)c3)c2c1
: