Target
Corticotropin-releasing factor receptor 1
Ligand
BDBM50293942
Substrate
Meas. Tech.
ChEMBL_572700 (CHEMBL1026899)
IC50
1.2±n/a nM
Citation
 Hartz, RAAhuja, VTRafalski, MSchmitz, WDBrenner, ABDenhart, DJDitta, JLDeskus, JAYue, EWArvanitis, AGLelas, SLi, YWMolski, TFWong, HGrace, JELentz, KALi, JLodge, NJZaczek, RCombs, APOlson, REMattson, RJBronson, JJMacor, JE In vitro intrinsic clearance-based optimization of N3-phenylpyrazinones as corticotropin-releasing factor-1 (CRF1) receptor antagonists. J Med Chem 52:4161-72 (2009)  
Target
Name:
Corticotropin-releasing factor receptor 1
Synonyms:
CRF-R CRFR1_RAT Corticotropin releasing factor receptor Corticotropin-releasing Factor Receptor 1 Crhr | Crhr1
Type:
G Protein-Coupled Receptor (GPCR)
Mol. Mass.:
47870.75
Organism:
Rattus norvegicus (rat)
Description:
Receptor binding assays were performed using rat cortex homogenate.
Residue:
415
  
Inhibitor
Name:
BDBM50293942
Synonyms:
(R)-5-Chloro-1-(1-cyclopropylethyl)-3-(4-ethoxy-2,5-dimethylphenylamino)pyrazin-2(1H)-one | CHEMBL559507
Type:
Small organic molecule
Emp. Form.:
C19H24ClN3O2
Mol. Mass.:
361.866
SMILES:
CCOc1cc(C)c(Nc2nc(Cl)cn([C@H](C)C3CC3)c2=O)cc1C
: