Target
Substance-P receptor
Ligand
BDBM50295067
Substrate
Meas. Tech.
ChEMBL_573423 (CHEMBL1061318)
Ki
0.052000±n/a nM
Citation
 Yamamoto, TNair, PJacobsen, NEVagner, JKulkarni, VDavis, PMa, SWNavratilova, EYamamura, HIVanderah, TWPorreca, FLai, JHruby, VJ Improving metabolic stability by glycosylation: bifunctional peptide derivatives that are opioid receptor agonists and neurokinin 1 receptor antagonists. J Med Chem 52:5164-75 (2010)  
Target
Name:
Substance-P receptor
Synonyms:
NK-1 receptor NK1 Receptor NK1R_HUMAN Neurokinin-1 (NK-1) SPR TACR1 Tachykinin receptor 1 (NK1) | tachykinin
Type:
G Protein-Coupled Receptor (GPCR)
Mol. Mass.:
46254.43
Organism:
Homo sapiens (Human)
Description:
P25103
Residue:
407
  
Inhibitor
Name:
BDBM50295067
Synonyms:
(S)-1-((2S,5S,11R,14S)-14-amino-5-benzyl-2-butyl-15-(4-hydroxyphenyl)-11-methyl-4,7,10,13-tetraoxo-3,6,9,12-tetraazapentadecane)-N-((S)-1-((S)-1-((S)-1-(3,5-bis(trifluoromethyl)benzylamino)-3-(1H-indol-3-yl)-1-oxopropan-2-ylamino)-3-((2R,3R,4S,5S,6R)-6-ethyl-3,4,5-trihydroxytetrahydro-2H-pyran-2-yloxy)-1-oxopropan-2-ylamino)-4-methyl-1-oxopentan-2-yl)pyrrolidine-2-carboxamide | CHEMBL556537
Type:
Small organic molecule
Emp. Form.:
C70H89F6N11O15
Mol. Mass.:
1438.5108
SMILES:
CCCC[C@H](NC(=O)[C@H](Cc1ccccc1)NC(=O)CNC(=O)[C@@H](C)NC(=O)[C@@H](N)Cc1ccc(O)cc1)C(=O)N1CCC[C@H]1C(=O)N[C@@H](CC(C)C)C(=O)N[C@@H](CO[C@@H]1O[C@H](CC)[C@@H](O)[C@H](O)[C@H]1O)C(=O)N[C@@H](Cc1c[nH]c2ccccc12)C(=O)NCc1cc(cc(c1)C(F)(F)F)C(F)(F)F
: