Target
Muscarinic acetylcholine receptor M3
Ligand
BDBM50296320
Substrate
Meas. Tech.
ChEMBL_581962 (CHEMBL1058942)
IC50
0.42±n/a nM
Citation
 Prat, MFernández, DBuil, MACrespo, MICasals, GFerrer, MTort, LCastro, JMonleón, JMGavaldà, AMiralpeix, MRamos, IDoménech, TVilella, DAntón, FHuerta, JMEspinosa, SLópez, MSentellas, SGonzález, MAlbertí, JSegarra, VCárdenas, ABeleta, JRyder, H Discovery of novel quaternary ammonium derivatives of (3R)-quinuclidinol esters as potent and long-acting muscarinic antagonists with potential for minimal systemic exposure after inhaled administration: identification of (3R)-3-{[hydroxy(di-2-thienyl)acetyl]oxy}-1-(3-phenoxypropyl)-1-azoniabicyclo J Med Chem 52:5076-92 (2010)  
Target
Name:
Muscarinic acetylcholine receptor M3
Synonyms:
ACM3_HUMAN Cholinergic, muscarinic M3 Muscarinic receptor M3 | RecName: Full=Muscarinic acetylcholine receptor M3
Type:
Enzyme
Mol. Mass.:
66151.03
Organism:
Homo sapiens (Human)
Description:
P20309
Residue:
590
  
Inhibitor
Name:
BDBM50296320
Synonyms:
(3R)-1-Azabicyclo[2.2.2]oct-3-yl(2R)-hydroxy(phenyl)2-thienylacetate | CHEMBL556426
Type:
Small organic molecule
Emp. Form.:
C19H21NO3S
Mol. Mass.:
343.44
SMILES:
O[C@](C(=O)O[C@H]1CN2CCC1CC2)(c1cccs1)c1ccccc1
: