Target
Insulin-like growth factor 1 receptor
Ligand
BDBM50296354
Substrate
Meas. Tech.
ChEMBL_582001 (CHEMBL1055738)
IC50
340±n/a nM
Citation
 Li, RPourpak, AMorris, SW Inhibition of the insulin-like growth factor-1 receptor (IGF1R) tyrosine kinase as a novel cancer therapy approach. J Med Chem 52:4981-5004 (2010)  
Target
Name:
Insulin-like growth factor 1 receptor
Synonyms:
CD_antigen=CD221 IGF1R Insulin-like growth factor 1 receptor (IGF1R) Insulin-like growth factor 1 receptor alpha chain Insulin-like growth factor I receptor | Insulin-like growth factor receptor (IGFR)
Type:
Protein
Mol. Mass.:
154776.79
Organism:
Homo sapiens (Human)
Description:
P08069
Residue:
1367
  
Inhibitor
Name:
BDBM50296354
Synonyms:
CHEMBL549369 | N-(5-(3,5-difluorophenylsulfonyl)-4,5,6,7-tetrahydro-1H-pyrazolo[4,3-c]pyridin-3-yl)-4-(4-methylpiperazin-1-yl)benzamide
Type:
Small organic molecule
Emp. Form.:
C24H26F2N6O3S
Mol. Mass.:
516.563
SMILES:
CN1CCN(CC1)c1ccc(cc1)C(=O)Nc1[nH]nc2CCN(Cc12)S(=O)(=O)c1cc(F)cc(F)c1
: