Target
11-beta-hydroxysteroid dehydrogenase type 2
Ligand
BDBM50185127
Substrate
Meas. Tech.
ChEMBL_584483 (CHEMBL1059162)
IC50
1.000000±n/a nM
Citation
 Zhang, XZhou, ZYang, HChen, JFeng, YDu, LLeng, YShen, J 4-(Phenylsulfonamidomethyl)benzamides as potent and selective inhibitors of the 11beta-hydroxysteroid dehydrogenase type 1 with efficacy in diabetic ob/ob mice. Bioorg Med Chem Lett 19:4455-8 (2009)  
Target
Name:
11-beta-hydroxysteroid dehydrogenase type 2
Synonyms:
11-DH2 11-beta-Hydroxysteroid Dehydrogenase 2 (11-beta-HSD2) 11-beta-hydroxysteroid dehydrogenase 2 11-beta-hydroxysteroid dehydrogenase type 2 (11-beta-HSD2) DHI2_HUMAN HSD11K SDR9C3
Type:
Enzyme
Mol. Mass.:
44141.72
Organism:
Homo sapiens (Human)
Description:
Purified recombinant human 11beta-HSD2.
Residue:
405
  
Inhibitor
Name:
BDBM50185127
Synonyms:
(3beta,20beta)-20-carboxy-11-oxo-30-norolean-12-en-3-yl-2-O-beta-D-glucopyranuronosyl-alpha-D-glucopyranosiduronic acid CHEMBL441687 glycyrrhizinic acid | glyzyrrhizin
Type:
Small organic molecule
Emp. Form.:
C42H62O16
Mol. Mass.:
822.9321
SMILES:
CC1(C)[C@H](CC[C@@]2(C)[C@H]1CC[C@]1(C)[C@@H]2C(=O)C=C2[C@@H]3C[C@](C)(CC[C@]3(C)CC[C@@]12C)C(O)=O)O[C@H]1O[C@@H]([C@@H](O)[C@H](O)[C@H]1O[C@@H]1O[C@@H]([C@@H](O)[C@H](O)[C@H]1O)C(O)=O)C(O)=O
: