Target
Neprilysin [1-24]
Ligand
BDBM21641
Substrate
Meas. Tech.
ChEMBL_585130 (CHEMBL1060019)
IC50
6.2±n/a nM
Citation
 Olimpieri, FTambaro, SFustero, SLazzari, PSanchez-Roselló, MPani, LVolonterio, AZanda, M Synthesis and enzymatic evaluation of novel partially fluorinated thiol dual ACE/NEP inhibitors. Bioorg Med Chem Lett 19:4715-9 (2009)  
Target
Name:
Neprilysin [1-24]
Synonyms:
MME Neprilysin
Type:
PROTEIN
Mol. Mass.:
2817.48
Organism:
Sus scrofa
Description:
ChEMBL_585130
Residue:
24
  
Inhibitor
Name:
BDBM21641
Synonyms:
2-(2-benzyl-3-sulfanylpropanamido)acetic acid Thiorphan
Type:
Small organic molecule
Emp. Form.:
C12H15NO3S
Mol. Mass.:
253.317
SMILES:
OC(=O)CNC(=O)C(CS)Cc1ccccc1
: