Target
Tyrosine-protein kinase CSK
Ligand
BDBM25116
Substrate
Meas. Tech.
ChEMBL_587228 (CHEMBL1061991)
IC50
640±n/a nM
Citation
 Bain, JPlater, LElliott, MShpiro, NHastie, CJMcLauchlan, HKlevernic, IArthur, JSAlessi, DRCohen, P The selectivity of protein kinase inhibitors: a further update. Biochem J 408:297-315 (2007)  
Target
Name:
Tyrosine-protein kinase CSK
Synonyms:
C-SRC kinase CSK Protein-tyrosine kinase CYL | Tyrosine Kinase CSK
Type:
Tyrosine-protein kinase
Mol. Mass.:
50707.30
Organism:
Homo sapiens (Human)
Description:
P41240
Residue:
450
  
Inhibitor
Name:
BDBM25116
Synonyms:
1-tert-butyl-3-(4-methylphenyl)-1H-pyrazolo[3,4-d]pyrimidin-4-amine PP1 US10807986, Comparative compound 1 US11701353, PP1 (Pfizer) | cid_1400
Type:
Small organic molecule
Emp. Form.:
C16H19N5
Mol. Mass.:
281.3556
SMILES:
Cc1ccc(cc1)-c1nn(c2ncnc(N)c12)C(C)(C)C
: