Target
Serine/threonine-protein kinase pim-3
Ligand
BDBM92455
Substrate
Meas. Tech.
ChEMBL_587118 (CHEMBL1051328)
IC50
83±n/a nM
Citation
 Bain, JPlater, LElliott, MShpiro, NHastie, CJMcLauchlan, HKlevernic, IArthur, JSAlessi, DRCohen, P The selectivity of protein kinase inhibitors: a further update. Biochem J 408:297-315 (2007)  
Target
Name:
Serine/threonine-protein kinase pim-3
Synonyms:
PIM3 Serine/threonine-protein kinase pim-3 (PIM3)
Type:
Protein
Mol. Mass.:
35888.19
Organism:
Homo sapiens (Human)
Description:
Q86V86
Residue:
326
  
Inhibitor
Name:
BDBM92455
Synonyms:
CHEMBL265470 | STO-609
Type:
Small organic molecule
Emp. Form.:
C19H10N2O3
Mol. Mass.:
314.2943
SMILES:
OC(=O)c1ccc2c3nc4ccccc4n3c(=O)c3cccc1c23
: