Target
Proto-oncogene tyrosine-protein kinase Src
Ligand
BDBM50229961
Substrate
Meas. Tech.
ChEMBL_586868 (CHEMBL1051363)
IC50
340±n/a nM
Citation
 Bain, JPlater, LElliott, MShpiro, NHastie, CJMcLauchlan, HKlevernic, IArthur, JSAlessi, DRCohen, P The selectivity of protein kinase inhibitors: a further update. Biochem J 408:297-315 (2007)  
Target
Name:
Proto-oncogene tyrosine-protein kinase Src
Synonyms:
Proto-oncogene c-Src SRC_CHICK c-Src p60c-src | pp60c-src
Type:
Tyr protein kinase
Mol. Mass.:
60015.36
Organism:
Gallus gallus (Chicken)
Description:
P00523
Residue:
533
  
Inhibitor
Name:
BDBM50229961
Synonyms:
1-(1,1-dimethylethyl)-3-(1-naphthalenyl)-1H-pyrazolo[3,4-d]pyrimidin-4-amine 1-NA-PP1 1-tert-butyl-3-naphthalen-1-yl-1H-pyrazolo[3,4-d]pyrimidin-4-amine CHEMBL264406 US11247972, Compound 1 | US9765037, Compound 1
Type:
Small organic molecule
Emp. Form.:
C19H19N5
Mol. Mass.:
317.3877
SMILES:
CC(C)(C)n1nc(-c2cccc3ccccc23)c2c(N)ncnc12
: