Target
Sodium-dependent noradrenaline transporter
Ligand
BDBM50302938
Substrate
Meas. Tech.
ChEMBL_595697 (CHEMBL1041760)
Ki
>10000±n/a nM
Citation
 Carroll, FIBlough, BEAbraham, PMills, ACHolleman, JAWolckenhauer, SADecker, AMLandavazo, AMcElroy, KTNavarro, HAGatch, MBForster, MJ Synthesis and biological evaluation of bupropion analogues as potential pharmacotherapies for cocaine addiction. J Med Chem 52:6768-81 (2009)  
Target
Name:
Sodium-dependent noradrenaline transporter
Synonyms:
Monoamine transporter NET Noradrenaline Transporter (NET) Norepinephrine transporter protein (NET) SLC6A2 Sodium-dependent noradrenaline transporter (NET) | Solute carrier family 6 member 2
Type:
Multi-pass membrane protein
Mol. Mass.:
69337.72
Organism:
Homo sapiens (Human)
Description:
P23975
Residue:
617
  
Inhibitor
Name:
BDBM50302938
Synonyms:
2-(tert-Butylamino)-3',5'-dichloropropiophenone CHEMBL578611
Type:
Small organic molecule
Emp. Form.:
C13H17Cl2NO
Mol. Mass.:
274.186
SMILES:
CC(NC(C)(C)C)C(=O)c1cc(Cl)cc(Cl)c1
: